{"text_format":"1","workbook":"xlsx","n_sheets":11,"sheets":["Title sheet","How to use","RE Inputs & Results","RE LCOE calc","Reference values","Storage Inputs & Results","LCOS calc","Storage charging cost","Cost projections","Storage references","Results"],"not_rendered":{"charts":1,"images":1,"macros":1,"external_links":0,"defined_names":100,"comments":7,"pivot_tables":0},"unopened":[],"bounds":{"document_bytes":16777216,"sheet_cells":100000,"rows_first":2000,"rows_last":500,"rows_between":2000,"halvings":0,"cell_chars":16384,"cell_head_chars":4096},"cells_cut":0,"cells_raw":0,"read":"whole","date_system":"1900"}

{"sheet":"Title sheet","index":0,"n_rows":22,"n_cols":6,"rows_kept":22,"cut":false,"hidden":false,"merged":[[21,4,28,13]]}
[]
[]
[]
[]
[]
[]
[]
[]
[]
[null,null,null,null,"Levelised Cost Calculator for Distributed Energy Resources"]
[]
[]
[null,null,null,null,"Authors:","Martin Scherfler"]
[null,null,null,null,null,"Rohith C Unni"]
[null,null,null,null,null,"Shiv Vembadi"]
{"$rows_left_out":8}
{"sheet":"How to use","index":1,"n_rows":18,"n_cols":2,"rows_kept":18,"cut":false,"hidden":false,"merged":[[17,14,17,15],[17,1,45,12],[1,1,14,12]]}
[null,"Introduction to the levelised cost calculator"]
[null,"The tool has been developed to calculate levelised cost of RE (orange sheets) and energy storage (blue sheets). The sheet RE LCOE calc contains the calculation for the levelised cost of energy (LCOE) for a specific RE technology, based on inputs entered in the sheet RE Inputs & Results. The sheet LCOS calc contains the calculation for levelised cost of storage (LCOS), based on inputs entered in the sheet Storage Inputs & Results. \n  ▪  LCOE can be calculated for Solar PV, Wind, Biomass, Bagasse and Small Hydro. The default input values have been taken from tariff orders, which are noted in the sheet Reference values. \n  ▪  LCOS can be calculated for different storage scenarios, including: Solar PV + LI-ion storage (medium capacity), and Standalone Li-ion storage. (Use Scenario Manager to select other in-built scenarios.) The cost inputs are divided into following components: solar PV, inverter cost, power capacity (kW) component of the battery storage system, and energy capacity (kWh) component of the battery system. The power capacity costs (INR/kW) takes into account the costs of balance of system (BOS) and the EPC. The energy capacity costs takes into account the cost of the battery pack. Further, see Storage Inputs & Results for details on cost inputs for the storage system.\n  ▪  The LCOS methodology is applicable to any storage technology, such as lead acid battery, vanadium redox flow battery, hydrogen storage - with the correct input parameters. The in-built scenarios are currently only for Li-ion application.\n\nLCOS calculation takes into account the storage module replacement and inverter replacement at the end of their lives (the EPC and BOS costs for the energy storage system are assumed constant for replacement).\n\nFor LCOS calculation, one of the inputs is the base yearfor calculating the LCOS. For calculation of LCOS in a future base year (e.g., 2030), future Li-ion module costs (both initial cost in Year 1 and replacement costs later) are calculated based on the cost in the Current year and the cost improvement curve given in Cost projections sheet. The sheet also provides other references on historical solar inverter and solar PV capital cost trends. To input future costs of inverter and solar PV for LCOS calculations, the user can make reasonable assumptions based on these."]
[]
[]
[]
[]
[]
[]
[]
[]
[]
[]
[]
[]
[]
{"$rows_left_out":4}
{"sheet":"RE Inputs & Results","index":2,"n_rows":46,"n_cols":13,"rows_kept":46,"cut":false,"hidden":false,"merged":[[7,1,7,5],[7,10,7,12]]}
[]
[]
[null,null,null,null,null,"Select Technology:"]
[]
[]
[]
[]
[null,"Inputs",null,null,null,null,null,null,"Solar PV",null,"Outputs"]
[]
[null,"Parameter",null,"Unit",null,"Value",null,null,null,null,"Gross capital cost","INR",{"$f":"Capex_perkW*System_size","v":33500000}]
[null,null,null,null,null,null,null,null,null,null,"Net capital cost","INR",{"$f":"(Capex_perkW-Capitalsubsidy_perkW)*System_size","v":33500000}]
[null,"General inputs",null,null,null,null,null,null,null,null,"Equity","INR",{"$f":"Net_capex*Equity_percentage","v":10050000}]
[null,"System capital cost per kW",null,"INR",null,33500,null,null,null,null,"Debt","INR",{"$f":"Net_capex-Equity","v":23450000}]
[null,"Capital subsidy per kW",null,"INR",null,0,null,null,null,null,"Annual depreciation for first n1 years (on gross capex)","INR",{"$f":"Gross_capex*Depreciationrate_n1years*Depreciation_on_capexpercentage","v":1145700}]
[null,"Plant size",null,"kW",null,1000,null,null,null,null,"Annual depreciation after n1 years (on gross capex)","INR",{"$f":"IF(n1_years<Plant_life,(Gross_capex*Depreciation_on_capexpercentage-Annual_depreciation_n1yearsgross*n1_years)/(Plant_life-n1_years),0)","v":0}]
{"$rows_left_out":32}
{"sheet":"RE LCOE calc","index":3,"n_rows":42,"n_cols":42,"rows_kept":42,"cut":false,"hidden":false,"merged":[]}
["This sheet shows the LCOE calculations"]
[null,null,null,null,null,null,null,null,null,null,null,null,"Year ----->"]
[null,"Parameter",null,"Unit",null,"Cumulative",null,1,{"$f":"H3+1","v":2},{"$f":"I3+1","v":3},4,5,6,7,8,9,10,11,12,13,14,15,16,17,18,19,20,21,22,23,24,25,{"$f":"AF3+1","v":26},27,28,29,30,31,32,33,34,35]
[]
[null,"Cost of Generation"]
[null,"Gross generation / kWh input (for Storage)",null,"kWh",null,null,null,{"$f":"System_size*24*365*CUF*Grid_availability*IF(Technology=\"Solar PV\",(1-SolarPV_degradation)^(H3-1),1)","v":1581180},1565368.2,1549714.5179999999,1534217.3728199999,1518875.1990918,1503686.447100882,1488649.582629873,1473763.0868035743,1459025.4559355385,1444435.201376183,1429990.8493624211,1415690.940868797,1401534.0314601089,1387518.6911455079,1373643.5042340527,1359907.0691917122,1346307.9984997951,1332844.9185147972,1319516.4693296491,1306321.3046363525,1293258.0915899891,1280325.5106740892,1267522.2555673481,1254847.0330116749,1242298.5626815581,1229875.5770547423,1217576.8212841949,1205401.0530713531,1193347.0425406394,1181413.5721152329,1169599.4363940808,1157903.4420301397,1146324.4076098385,1134861.16353374,1123512.5518984026]
[null,"Net generation / kWh available (for Storage)",null,"kWh",null,null,null,{"$f":"H6-(H6*Aux_consumption)","v":1581180},1565368.2,1549714.5179999999,1534217.3728199999,1518875.1990918,1503686.447100882,1488649.582629873,1473763.0868035743,1459025.4559355385,1444435.201376183,1429990.8493624211,1415690.940868797,1401534.0314601089,1387518.6911455079,1373643.5042340527,1359907.0691917122,1346307.9984997951,1332844.9185147972,1319516.4693296491,1306321.3046363525,1293258.0915899891,1280325.5106740892,1267522.2555673481,1254847.0330116749,1242298.5626815581,1229875.5770547423,1217576.8212841949,1205401.0530713531,1193347.0425406394,1181413.5721152329,1169599.4363940808,1157903.4420301397,1146324.4076098385,1134861.16353374,1123512.5518984026]
[null,"Operation and Maintenance Expenses",null,"INR",null,null,null,{"$f":"OandM_year1*Gross_capex","v":469000},{"$f":"H8+(H8*OandM_escalation)","v":495826.8},524188.09295999998,554171.65187731199,585870.27036469418,619382.04982955474,654810.70307980524,692265.87529597012,731863.48336289963,773726.07461125753,817983.20607902145,864771.84546674148,914236.79502743913,966531.1397030087,1021816.7208940207,1080264.6373291588,1142055.7745843867,1207381.3648906136,1276443.5789623568,1349456.1516790036,1426645.0435550427,1508249.1400463912,1594520.9908570447,1685727.5915340676,1782151.2097698164,1884090.2589686499,1991860.2217816566,2105794.6264675674,2226246.0791015122,2353587.3548261188,2488212.551522173,2630538.3094692412,2781005.1007708819,2940078.5925349761,3108251.0880279769]
[null,"Insurance",null,"INR",null,null,null,{"$f":"Insurance*H42","v":117250},113240.05,109230.1,105220.15000000001,101210.2,97200.25,93190.3,89180.35,85170.400000000009,81160.45,77150.5,73140.55,69130.600000000006,65120.65,61110.700000000004,57100.75,53090.8,49080.85,45070.9,41060.950000000004,37051,33041.050000000003,29031.100000000002,25021.15,21011.200000000001,17001.25,17001.25,17001.25,17001.25,17001.25,17001.25,17001.25,17001.25,17001.25,17001.25]
[null,"Depreciation (on gross capital cost)",null,null,null,null,null,{"$f":"IF(H3<=n1_years, Annual_depreciation_n1yearsgross, Annual_depreciation_aftern1gross)","v":1145700},1145700,1145700,1145700,1145700,1145700,1145700,1145700,1145700,1145700,1145700,1145700,1145700,1145700,1145700,1145700,1145700,1145700,1145700,1145700,1145700,1145700,1145700,1145700,1145700,0,0,0,0,0,0,0,0,0,0]
[null,"Depreciation (on net capital cost)",null,"INR",null,null,null,{"$f":"IF(H3<=n1_years, Annual_depreciation_n1yearsnet, Annual_depreciation_aftern1net)","v":1145700},1145700,1145700,1145700,1145700,1145700,1145700,1145700,1145700,1145700,1145700,1145700,1145700,1145700,1145700,1145700,1145700,1145700,1145700,1145700,1145700,1145700,1145700,1145700,1145700,0,0,0,0,0,0,0,0,0,0]
[null,"Interest on Term Loan",null,"INR",null,null,null,{"$f":"H27","v":2473975},2473975,2199088.888888889,1924202.7777777775,1649316.6666666665,1374430.5555555553,1099544.4444444443,824658.33333333302,549772.2222222219,274886.11111111077,0,0,0,0,0,0,0,0,0,0,0,0,0,0,0,{"$f":"AG27","v":0},0,0,0,0,0,0,0,0,0]
[null,"Interest on Working Capital",null,"INR",null,null,null,{"$f":"H32+H36","v":119614.47815625},{"$f":"I32+I36","v":120316.8809717875},115772.31894542987,111274.90042405399,106827.32201614488,102432.43457619281,98093.252027564944,93812.960690044987,89594.929140908323,85442.718640050516,81360.094151433077,82642.593633845056,84002.867442595991,85445.364269152487,86974.787270132991,88596.108622714615,90314.584912608872,92135.773402230116,94065.549229402677,96110.123589834504,98276.062959628049,100570.30941731877,103000.20212833441,105573.50005836511,108298.40598593862,89128.866888514298,92260.692318162313,95571.6581623862,99072.011252899712,102772.58454019055,106684.83061951447,110820.85717457571,115193.46444858643,119816.18485867055,124703.32487621153]
[null,"Return on Equity",null,"INR",null,null,null,{"$f":"Equity*ROE","v":1768800},1768800,1768800,1768800,1768800,1768800,1768800,1768800,1768800,1768800,1768800,1768800,1768800,1768800,1768800,1768800,1768800,1768800,1768800,1768800,1768800,1768800,1768800,1768800,1768800,1768800,1768800,1768800,1768800,1768800,1768800,1768800,1768800,1768800,1768800]
[null,"Fuel cost",null,"INR",null,null,null,{"$f":"IF(OR(Technology=\"Biomass\",Technology=\"Bagasse\"),(H6*'RE Inputs & Results'!$F$44*'RE Inputs & Results'!$F$45)/1000,0)","v":0},{"$f":"IF(OR(Technology=\"Biomass\",Technology=\"Bagasse\"),H15*(1+Bio_fuelcost_escalation),0)","v":0},0,0,0,0,0,0,0,0,0,0,0,0,0,0,0,0,0,0,0,0,0,0,0,0,0,0,0,0,0,0,0,0,0]
{"$rows_left_out":28}
{"sheet":"Reference values","index":4,"n_rows":29,"n_cols":14,"rows_kept":29,"cut":false,"hidden":false,"merged":[]}
[]
[]
[null,"Assumption",null,"Unit",null,"Solar PV",null,"Wind",null,"Biomass",null,"Bagasse",null,"Small Hydro"]
[null,"Capital cost",null,"INR/kW",null,33500,null,52500,null,55000,null,52000,null,74300]
[null,"Auxiliary Consumption",null,"%",null,0,null,0,null,10,null,8.5,null,1]
[null,"Capacity utilisation factor",null,"%",null,19,null,29,null,80,null,55,null,30]
[null,"Station heat rate",null,"kCal/kWh",null,null,null,null,null,3840,null,3240]
[null,"Calorific value ",null,"kCal/kg",null,null,null,null,null,3200,null,2300]
[null,"Specific fuel consumption",null,"kg/kWh",null,null,null,null,null,1.2,null,1.41]
[null,"Fuel rate",null,"INR/MT",null,null,null,null,null,2967.35,null,1834.35]
[null,"Fuel cost escalation",null,"%",null,null,null,null,null,0.05,null,0.05]
[null,"Grid availability factor",null,"%",null,95,null,95]
[null,"Annual degradation",null,"%",null,1,null,1.6]
[null,"Operation and Maintenance Expenses in year 1",null,null,null,1.4,null,9.7000000000000003E-3,null,4.3899999999999997,null,4.3,null,3.56]
[null,"Annual increase in Operation and Maintenance Expenses",null,"%",null,5.72,null,5,null,5.72,null,5.72,null,5.72]
{"$rows_left_out":15}
{"sheet":"Storage Inputs & Results","index":5,"n_rows":67,"n_cols":13,"rows_kept":67,"cut":false,"hidden":false,"merged":[[7,1,7,5],[7,10,7,12]]}
[]
[]
[null,null,null,"Select Technology/Scenario:"]
[]
[]
[]
[]
[null,"Inputs",null,null,null,null,null,null,"Solar+Storage",null,"System size & outputs"]
[]
[null,"Parameter",null,"Unit",null,"Value",null,null,null,null,"Solar PV size","kW",{"$f":"SolarPV_size","v":24}]
[null,null,null,null,null,null,null,null,null,null,"Inverter capacity","kW",{"$f":"Storage_inverter_capacity","v":12}]
[null,"General inputs",null,null,null,null,null,null,null,null,"Battery capacity","kWh",{"$f":"Storage_power_capacity*Storage_duration","v":48}]
[null,"Current year",null,"year",null,2020,null,null,null,null,"Battery life","years",{"$f":"ROUND(Storage_life_cycles/Storage_annual_cycles,0)","v":11}]
[null,"Base year for LCOS calculation",null,"year",null,2020,null,null,null,null,"Solar generated passing through battery (Year 1)","%",{"$f":"IF(I8=\"Standalone\", \"-\", IF('LCOS calc'!H95>'LCOS calc'!H94*Storage_excess_solar, Storage_excess_solar, 'LCOS calc'!H95/'LCOS calc'!H94))","v":0.43859649122807021}]
[null,"Discount rate",null,"%",null,9.5299999999999996E-2,null,null,null,null,"Solar exported (Year 1)","%",{"$f":"IF(I8=\"Standalone\", \"-\", IF('LCOS calc'!H95>'LCOS calc'!H94*Storage_excess_solar, 0, ('LCOS calc'!H94*Storage_excess_solar-'LCOS calc'!H95)/'LCOS calc'!H94))","v":6.1403508771929807E-2}]
{"$rows_left_out":53}
{"sheet":"LCOS calc","index":6,"n_rows":109,"n_cols":32,"rows_kept":109,"cut":false,"hidden":false,"merged":[]}
["This sheet shows the LCOS calculations"]
[null,null,null,null,null,null,null,null,null,null,null,null,"Year ----->"]
[null,"Parameter",null,"Unit",null,"Cumulative",null,1,{"$f":"H3+1","v":2},{"$f":"I3+1","v":3},4,5,6,7,8,9,10,11,12,13,14,15,16,17,18,19,20,21,22,23,24,25]
[]
[null,"Storage cost timeline"]
[null,"Year",null,null,null,null,null,{"$f":"Storage_base_year","v":2020},{"$f":"H6+1","v":2021},{"$f":"I6+1","v":2022},2023,2024,2025,2026,2027,2028,2029,2030,2031,2032,2033,2034,2035,2036,2037,2038,2039,2040,2041,2042,2043,2044]
[null,"Storage operation year",null,null,null,null,null,{"$f":"IF(MOD(H3,Storage_life)=0, Storage_life, MOD(H3,Storage_life))","v":1},2,3,4,5,6,7,8,9,10,11,1,2,3,4,5,6,7,8,9,10,11,1,2,3]
[null,"Battery pack cost per kWh in year n",null,"INR",null,null,null,{"$f":"IF(H7=1, (Storage_module_capexperkWh*VLOOKUP('LCOS calc'!H6, 'Cost projections'!$B$4:$D$49, 3)/VLOOKUP(Storage_base_year, 'Cost projections'!$B$4:$D$49, 3)), 0)","v":20000},{"$f":"IF(I7=1, (Storage_module_capexperkWh*VLOOKUP('LCOS calc'!I6, 'Cost projections'!$B$4:$D$39, 3)/VLOOKUP(Storage_base_year, 'Cost projections'!$B$4:$D$39, 3)), 0)","v":0},{"$f":"IF(J7=1, (Storage_module_capexperkWh*VLOOKUP('LCOS calc'!J6, 'Cost projections'!$B$4:$D$39, 3)/VLOOKUP(Storage_base_year, 'Cost projections'!$B$4:$D$39, 3)), 0)","v":0},{"$f":"IF(K7=1, (Storage_module_capexperkWh*VLOOKUP('LCOS calc'!K6, 'Cost projections'!$B$4:$D$39, 3)/VLOOKUP(Storage_base_year, 'Cost projections'!$B$4:$D$39, 3)), 0)","v":0},{"$f":"IF(L7=1, (Storage_module_capexperkWh*VLOOKUP('LCOS calc'!L6, 'Cost projections'!$B$4:$D$39, 3)/VLOOKUP(Storage_base_year, 'Cost projections'!$B$4:$D$39, 3)), 0)","v":0},{"$f":"IF(M7=1, (Storage_module_capexperkWh*VLOOKUP('LCOS calc'!M6, 'Cost projections'!$B$4:$D$39, 3)/VLOOKUP(Storage_base_year, 'Cost projections'!$B$4:$D$39, 3)), 0)","v":0},{"$f":"IF(N7=1, (Storage_module_capexperkWh*VLOOKUP('LCOS calc'!N6, 'Cost projections'!$B$4:$D$39, 3)/VLOOKUP(Storage_base_year, 'Cost projections'!$B$4:$D$39, 3)), 0)","v":0},{"$f":"IF(O7=1, (Storage_module_capexperkWh*VLOOKUP('LCOS calc'!O6, 'Cost projections'!$B$4:$D$39, 3)/VLOOKUP(Storage_base_year, 'Cost projections'!$B$4:$D$39, 3)), 0)","v":0},{"$f":"IF(P7=1, (Storage_module_capexperkWh*VLOOKUP('LCOS calc'!P6, 'Cost projections'!$B$4:$D$39, 3)/VLOOKUP(Storage_base_year, 'Cost projections'!$B$4:$D$39, 3)), 0)","v":0},{"$f":"IF(Q7=1, (Storage_module_capexperkWh*VLOOKUP('LCOS calc'!Q6, 'Cost projections'!$B$4:$D$39, 3)/VLOOKUP(Storage_base_year, 'Cost projections'!$B$4:$D$39, 3)), 0)","v":0},{"$f":"IF(R7=1, (Storage_module_capexperkWh*VLOOKUP('LCOS calc'!R6, 'Cost projections'!$B$4:$D$39, 3)/VLOOKUP(Storage_base_year, 'Cost projections'!$B$4:$D$39, 3)), 0)","v":0},{"$f":"IF(S7=1, (Storage_module_capexperkWh*VLOOKUP('LCOS calc'!S6, 'Cost projections'!$B$4:$D$39, 3)/VLOOKUP(Storage_base_year, 'Cost projections'!$B$4:$D$39, 3)), 0)","v":7999.9999999999991},{"$f":"IF(T7=1, (Storage_module_capexperkWh*VLOOKUP('LCOS calc'!T6, 'Cost projections'!$B$4:$D$39, 3)/VLOOKUP(Storage_base_year, 'Cost projections'!$B$4:$D$39, 3)), 0)","v":0},{"$f":"IF(U7=1, (Storage_module_capexperkWh*VLOOKUP('LCOS calc'!U6, 'Cost projections'!$B$4:$D$39, 3)/VLOOKUP(Storage_base_year, 'Cost projections'!$B$4:$D$39, 3)), 0)","v":0},{"$f":"IF(V7=1, (Storage_module_capexperkWh*VLOOKUP('LCOS calc'!V6, 'Cost projections'!$B$4:$D$39, 3)/VLOOKUP(Storage_base_year, 'Cost projections'!$B$4:$D$39, 3)), 0)","v":0},{"$f":"IF(W7=1, (Storage_module_capexperkWh*VLOOKUP('LCOS calc'!W6, 'Cost projections'!$B$4:$D$39, 3)/VLOOKUP(Storage_base_year, 'Cost projections'!$B$4:$D$39, 3)), 0)","v":0},{"$f":"IF(X7=1, (Storage_module_capexperkWh*VLOOKUP('LCOS calc'!X6, 'Cost projections'!$B$4:$D$39, 3)/VLOOKUP(Storage_base_year, 'Cost projections'!$B$4:$D$39, 3)), 0)","v":0},{"$f":"IF(Y7=1, (Storage_module_capexperkWh*VLOOKUP('LCOS calc'!Y6, 'Cost projections'!$B$4:$D$39, 3)/VLOOKUP(Storage_base_year, 'Cost projections'!$B$4:$D$39, 3)), 0)","v":0},{"$f":"IF(Z7=1, (Storage_module_capexperkWh*VLOOKUP('LCOS calc'!Z6, 'Cost projections'!$B$4:$D$39, 3)/VLOOKUP(Storage_base_year, 'Cost projections'!$B$4:$D$39, 3)), 0)","v":0},{"$f":"IF(AA7=1, (Storage_module_capexperkWh*VLOOKUP('LCOS calc'!AA6, 'Cost projections'!$B$4:$D$39, 3)/VLOOKUP(Storage_base_year, 'Cost projections'!$B$4:$D$39, 3)), 0)","v":0},{"$f":"IF(AB7=1, (Storage_module_capexperkWh*VLOOKUP('LCOS calc'!AB6, 'Cost projections'!$B$4:$D$39, 3)/VLOOKUP(Storage_base_year, 'Cost projections'!$B$4:$D$39, 3)), 0)","v":0},{"$f":"IF(AC7=1, (Storage_module_capexperkWh*VLOOKUP('LCOS calc'!AC6, 'Cost projections'!$B$4:$D$39, 3)/VLOOKUP(Storage_base_year, 'Cost projections'!$B$4:$D$39, 3)), 0)","v":0},{"$f":"IF(AD7=1, (Storage_module_capexperkWh*VLOOKUP('LCOS calc'!AD6, 'Cost projections'!$B$4:$D$39, 3)/VLOOKUP(Storage_base_year, 'Cost projections'!$B$4:$D$39, 3)), 0)","v":5454.545454545454},{"$f":"IF(AE7=1, (Storage_module_capexperkWh*VLOOKUP('LCOS calc'!AE6, 'Cost projections'!$B$4:$D$39, 3)/VLOOKUP(Storage_base_year, 'Cost projections'!$B$4:$D$39, 3)), 0)","v":0},{"$f":"IF(AF7=1, (Storage_module_capexperkWh*VLOOKUP('LCOS calc'!AF6, 'Cost projections'!$B$4:$D$39, 3)/VLOOKUP(Storage_base_year, 'Cost projections'!$B$4:$D$39, 3)), 0)","v":0}]
[null,"Gross capital cost",null,"INR",null,null,null,{"$f":"IF(H7=1, (Storage_capacity*H8+Storage_rack_capexperkW*Storage_power_capacity+Storage_EPC_capexperkW*Storage_power_capacity), 0)","v":1040400},0,0,0,0,0,0,0,0,0,0,464399.99999999994,0,0,0,0,0,0,0,0,0,0,342218.18181818177,0,0]
[null,"Net capital cost",null,"INR",null,null,null,{"$f":"IF(H7=1, (Storage_capacity*H8*(1-Storage_capitalsubsidy_percentage)+Storage_rack_capexperkW*Storage_power_capacity+Storage_EPC_capexperkW*Storage_power_capacity), 0)","v":1040400},0,0,0,0,0,0,0,0,0,0,464399.99999999994,0,0,0,0,0,0,0,0,0,0,342218.18181818177,0,0]
[null,"Equity",null,"INR",null,null,null,{"$f":"H10*Storage_equity_percentage","v":312120},0,0,0,0,0,0,0,0,0,0,139319.99999999997,0,0,0,0,0,0,0,0,0,0,102665.45454545453,0,0]
[null,"Debt",null,"INR",null,null,null,{"$f":"H10-H11","v":728280},{"$f":"I10-I11","v":0},0,0,0,0,0,0,0,0,0,325080,0,0,0,0,0,0,0,0,0,0,239552.72727272724,0,0]
[null,"Annual depreciation (on gross capital cost)",null,"INR",null,null,null,{"$f":"IF(H7=1, H9*Storage_depreciationrate_storage*Storage_depreciation_on_capexpercentage, G13)","v":80867.454545454544},80867.454545454544,80867.454545454544,80867.454545454544,80867.454545454544,80867.454545454544,80867.454545454544,80867.454545454544,80867.454545454544,80867.454545454544,80867.454545454544,36096.545454545449,36096.545454545449,36096.545454545449,36096.545454545449,36096.545454545449,36096.545454545449,36096.545454545449,36096.545454545449,36096.545454545449,36096.545454545449,36096.545454545449,26599.685950413215,26599.685950413215,26599.685950413215]
[null,"Annual depreciation (on net capital cost)",null,"INR",null,null,null,{"$f":"IF(H7=1, H10*Storage_depreciationrate_storage*Storage_depreciation_on_capexpercentage, G14)","v":80867.454545454544},80867.454545454544,80867.454545454544,80867.454545454544,80867.454545454544,80867.454545454544,80867.454545454544,80867.454545454544,80867.454545454544,80867.454545454544,80867.454545454544,36096.545454545449,36096.545454545449,36096.545454545449,36096.545454545449,36096.545454545449,36096.545454545449,36096.545454545449,36096.545454545449,36096.545454545449,36096.545454545449,36096.545454545449,26599.685950413215,26599.685950413215,26599.685950413215]
[null,"Asset value",null,"INR",null,null,null,{"$f":"IF(H7=1, H9, G15-G13)","v":1040400},{"$f":"IF(I7=1, I9, H15-H13)","v":959532.54545454541},{"$f":"IF(J7=1, J9, I15-I13)","v":878665.09090909082},797797.63636363624,716930.18181818165,636062.72727272706,555195.27272727247,474327.81818181794,393460.36363636341,312592.90909090888,231725.45454545435,464399.99999999994,428303.45454545447,392206.909090909,356110.36363636353,320013.81818181806,283917.27272727259,247820.72727272715,211724.18181818171,175627.63636363627,139531.09090909082,103434.54545454538,342218.18181818177,315618.49586776854,289018.80991735531]
{"$rows_left_out":95}
{"sheet":"Storage charging cost","index":7,"n_rows":18,"n_cols":4,"rows_kept":18,"cut":false,"hidden":false,"merged":[]}
[]
[]
[null,"Charging source",null,"Cost (Rs/kWh)"]
[null,"Solar PV",null,0]
[null,"Domestic (1-50 kWh)",null,2.5]
[null,"Domestic (51-100 kWh)",null,2.5]
[null,"Domestic (101-250 kWh)",null,3]
[null,"Domestic (Above 250 kWh)",null,6.6]
[null,"Public Lighting",null,6.35]
[null,"LT Govt. Educational Institution",null,5.75]
[null,"LT Pvt. Educational Institution",null,7.5]
[null,"LT Industries",null,6.35]
[null,"LT Commercial (Above 50 kWh)",null,8.0500000000000007]
[null,"HT Industries",null,6.35]
[null,"HT Govt. Educational Institution",null,6.35]
{"$rows_left_out":4}
{"sheet":"Cost projections","index":8,"n_rows":49,"n_cols":10,"rows_kept":49,"cut":false,"hidden":false,"merged":[]}
[]
[null,"Li-ion storage cost improvement curve"]
[null,"Year",null,"Cost improvement (%)"]
[null,2015,null,1]
[null,2016,null,0.92]
[null,2017,null,0.8]
[null,2018,null,0.71]
[null,2019,null,0.62]
[null,2020,null,0.55000000000000004]
[null,2021,null,0.49,null,null,null,null,2015,100]
[null,2022,null,0.44,null,null,null,null,2020,55]
[null,2023,null,0.41,null,null,null,null,2025,34]
[null,2024,null,0.37,null,null,null,null,2030,23]
[null,2025,null,0.34,null,null,null,null,2035,18]
[null,2026,null,0.31,null,null,null,null,2040,16]
{"$rows_left_out":35}
{"sheet":"Storage references","index":9,"n_rows":1,"n_cols":1,"rows_kept":1,"cut":false,"hidden":false,"merged":[[0,0,6,13]]}
["This tool uses the cost improvement curve on this sheet to calculate the future cost of Li-ion storage modules. The cost curve is based on the following reference: \nSchmidt, O., Melchior, S., Hawkes, A., and Staffell, I. (2018). The future cost of electrical energy storage based on experience rates:dataset. Figshare Digital Repository (2018). Available at: https://doi.org/10.6084/m9.figshare.\n\nHistorical inverter price trends (global and Indian context) are noted at: https://renewablewatch.in/2017/10/24/solar-inverter-trends/\n\nMNRE's benchmark capital costs for rooftop solar provide a reference for historical price trends in solar PV.\n"]

{"sheet":"Results","index":10,"n_rows":18,"n_cols":11,"rows_kept":18,"cut":false,"hidden":true,"merged":[]}
[]
[]
[]
[null,null,"Parameter",null,"Unit",null,"Solar+Storage (LT Industry)",null,"Solar+Storage (LT Industry)",null,"Standalone Storage (LT Industry)"]
[null,null,"Installation year",null,null,null,2020,null,2025,null,2020]
[null,null,"Solar PV capital cost (w/o inverter)",null,"INR/kW",null,41000,null,35000,null,41000]
[null,null,"Solar PV capacity",null,"kW",null,24,null,24,null,24]
[null,null,"Inverter capital cost",null,"INR/kVA",null,20000,null,16000]
[null,null,"Inverter replacement year",null,null,null,13,null,13,null,13]
[null,null,"Inverter cost improvement in replacement year",null,null,null,0.6,null,0.7,null,0.6]
[null,null,"Inverter capacity",null,"kVA",null,12,null,12,null,12]
[null,null,"Storage capital cost",null,"INR/kWh",null,20000,null,12000,null,20000]
[null,null,"Storage rack and others",null,"INR",null,64000,null,64000,null,64000]
[null,null,"EPC cost",null,"INR",null,14000,null,14000,null,14000]
[null,null,"Storage duration",null,"Hr",null,4,null,4,null,4]
{"$rows_left_out":3}