{"text_format":"1","workbook":"xlsx","n_sheets":12,"sheets":["Title sheet","How to use","RE LCOE - Inputs & Results","RE LCOE calc","RE references","LCOS - Inputs & Results","LCOS calc","Future LCOS","Cost projections","Tariff rates in TN","Storage references","Results"],"not_rendered":{"charts":7,"images":10,"macros":1,"external_links":0,"defined_names":121,"comments":8,"pivot_tables":0},"unopened":[],"bounds":{"document_bytes":16777216,"sheet_cells":100000,"rows_first":2000,"rows_last":500,"rows_between":2000,"halvings":0,"cell_chars":16384,"cell_head_chars":4096},"cells_cut":0,"cells_raw":0,"read":"whole","date_system":"1900"}

{"sheet":"Title sheet","index":0,"n_rows":22,"n_cols":4,"rows_kept":22,"cut":false,"hidden":false,"merged":[[21,2,28,11]]}
[]
[]
[]
[]
[]
[]
[]
[]
[]
[null,null,"Levelised Cost Calculator for Distributed Energy Resources"]
{"$rows_left_out":13}
{"sheet":"How to use","index":1,"n_rows":20,"n_cols":2,"rows_kept":20,"cut":false,"hidden":false,"merged":[[19,14,19,15],[19,1,47,12],[2,1,15,12]]}
[null,"INTRODUCTION TO THE LEVELISED COST CALCULATOR"]
[]
[null,"The tool has been developed to calculate levelised cost of energy (LCOE), from renewable energy (RE) technlogies (orange sheets) and from energy storage (blue sheets). The sheet RE LCOE calc calculates the LCOE for a RE technology, based on inputs entered in the sheet RE LCOE - Inputs & Results. The sheet LCOS calc contains the calculations for levelised cost of storage (LCOS), based on inputs entered in the sheet LCOS - Inputs & Results. \n  ▪  LCOE can be calculated for Solar PV, Wind, Biomass, Bagasse, Biomass Gasifer, Biogas and Small Hydro. The references for default input values are provided in the sheet Reference values. \n  ▪  LCOS can be calculated for two storage configurations: solar plus energy storage, and standalone energy storage. \n         -  LCOS is calculated based on detailed storage dynamics and bottom-up cost analysis. The methodology is applicable to any storage technology, such as lead acid battery, vanadium redox flow battery, hydrogen storage - with the correct input parameters.\n         - The cost inputs are divided into following components: solar PV, inverter or power conversion system, and battery storage system. The battery storage systems cost inlcude the cost of battery pack (INR/kWh), cost of balance of system (BOS) (INR/kWh) and installation cost. Further, see LCOS - Inputs & Results for details on cost inputs for the battery energy storage system.\n         - LCOS calculation takes into account the storage module replacement and inverter replacement at the end of their lives (the EPC and BOS costs for the energy storage system are assumed constant for replacement).\n\nThe sheet Future LCOS can be used to project levelised cost of solar plus energy storage (LCOSS) up to 2030 based on assumed cost reduction curves in Cost projections sheet. Installation cost for battery storage system is assumed to escalate at the same rate as the operation and maintenance expenses. These projections don't take into account technological innovations that will lead to a step increase in performance characteristics, for example, increase in wafer size in solar PV or solid state Li-ion batteries."]
[]
[]
[]
[]
[]
[]
[]
{"$rows_left_out":11}
{"sheet":"RE LCOE - Inputs & Results","index":2,"n_rows":48,"n_cols":12,"rows_kept":48,"cut":false,"hidden":false,"merged":[[10,2,10,4],[10,9,10,11]]}
[]
[null,null,null,null,"SELECT TECHNOLOGY:"]
[]
[]
[]
[]
[]
[]
[]
[]
{"$rows_left_out":39}
{"sheet":"RE LCOE calc","index":3,"n_rows":43,"n_cols":54,"rows_kept":43,"cut":false,"hidden":false,"merged":[]}
["This sheet contains the LCOE calculations."]
[]
[null,null,null,null,null,null,null,null,null,"Year ----->"]
[null,"Parameter","Unit","Cumulative",1,{"$f":"E4+1","v":2},{"$f":"F4+1","v":3},4,5,6,7,8,9,10,11,12,13,14,15,16,17,18,19,20,21,22,23,24,25,{"$f":"AC4+1","v":26},27,28,29,30,31,32,33,34,35,{"$f":"AM4+1","v":36},{"$f":"AN4+1","v":37},{"$f":"AO4+1","v":38},{"$f":"AP4+1","v":39},{"$f":"AQ4+1","v":40},{"$f":"AR4+1","v":41},{"$f":"AS4+1","v":42},{"$f":"AT4+1","v":43},{"$f":"AU4+1","v":44},{"$f":"AV4+1","v":45},{"$f":"AW4+1","v":46},{"$f":"AX4+1","v":47},{"$f":"AY4+1","v":48},{"$f":"AZ4+1","v":49},{"$f":"BA4+1","v":50}]
[]
[null,"Cost of Generation"]
[null,"Gross generation / kWh input (for Storage)","kWh",null,{"$f":"System_size*24*365*CUF*Grid_availability*IF(Technology=\"Solar PV\",(1-SolarPV_degradation)^(E4-1),1)","v":7489800},7489800,7489800,7489800,7489800,7489800,7489800,7489800,7489800,7489800,7489800,7489800,7489800,7489800,7489800,7489800,7489800,7489800,7489800,7489800,7489800,7489800,7489800,7489800,7489800,7489800,7489800,7489800,7489800,7489800,7489800,7489800,7489800,7489800,7489800,{"$f":"System_size*24*365*CUF*Grid_availability*IF(Technology=\"Solar PV\",(1-SolarPV_degradation)^(AN4-1),1)","v":7489800},7489800,7489800,7489800,7489800,7489800,7489800,7489800,7489800,7489800,7489800,7489800,7489800,7489800,7489800]
[null,"Net generation / kWh available (for Storage)","kWh",null,{"$f":"E7-(E7*Aux_consumption)","v":6591024},6591024,6591024,6591024,6591024,6591024,6591024,6591024,6591024,6591024,6591024,6591024,6591024,6591024,6591024,6591024,6591024,6591024,6591024,6591024,6591024,6591024,6591024,6591024,6591024,6591024,6591024,6591024,6591024,6591024,6591024,6591024,6591024,6591024,6591024,{"$f":"AN7-(AN7*Aux_consumption)","v":6591024},6591024,6591024,6591024,6591024,6591024,6591024,6591024,6591024,6591024,6591024,6591024,6591024,6591024,6591024]
[null,"Operation and Maintenance Expenses","INR",null,{"$f":"OandM_year1*System_size","v":6131000},{"$f":"E9+(E9*OandM_escalation)","v":6366430.4000000004},6610901.3273600005,6864759.9383306243,7128366.7199625205,7402096.0020090817,7686336.4884862304,7981491.8096441012,8287981.0951344343,8606239.5691875964,8936719.1686444003,9279889.1847203448,9636236.9294136055,10006268.427503088,10390509.135119207,10789504.685907785,11203821.665846644,11634048.417815154,12080795.877059257,12544698.438738331,13026414.858785883,13526629.18936326,14046051.750234809,14585420.137443826,15145500.270721668,15727087.481117381,16331007.640392289,16958118.333783351,17609310.077800632,18285507.584788177,18987671.076044042,19716797.645364132,20473922.674946114,21260121.305664044,22076509.963801544,{"$f":"AM9+(AM9*OandM_escalation)","v":22924247.946411524},{"$f":"AN9+(AN9*OandM_escalation)","v":23804539.067553725},{"$f":"AO9+(AO9*OandM_escalation)","v":24718633.367747787},{"$f":"AP9+(AP9*OandM_escalation)","v":25667828.889069304},{"$f":"AQ9+(AQ9*OandM_escalation)","v":26653473.518409565},{"$f":"AR9+(AR9*OandM_escalation)","v":27676966.901516493},{"$f":"AS9+(AS9*OandM_escalation)","v":28739762.430534728},{"$f":"AT9+(AT9*OandM_escalation)","v":29843369.307867263},{"$f":"AU9+(AU9*OandM_escalation)","v":30989354.689289365},{"$f":"AV9+(AV9*OandM_escalation)","v":32179345.909358077},{"$f":"AW9+(AW9*OandM_escalation)","v":33415032.792277426},{"$f":"AX9+(AX9*OandM_escalation)","v":34698170.051500879},{"$f":"AY9+(AY9*OandM_escalation)","v":36030579.781478509},{"$f":"AZ9+(AZ9*OandM_escalation)","v":37414154.045087285},{"$f":"BA9+(BA9*OandM_escalation)","v":38850857.560418636}]
[null,"Insurance","INR",null,{"$f":"Insurance*E43","v":0},0,0,0,0,0,0,0,0,0,0,0,0,0,0,0,0,0,0,0,0,0,0,0,0,0,0,0,0,0,0,0,0,0,0,{"$f":"Insurance*AN43","v":0},0,0,0,0,0,0,0,0,0,0,0,0,0,0]
{"$rows_left_out":34}
{"sheet":"RE references","index":4,"n_rows":44,"n_cols":10,"rows_kept":44,"cut":false,"hidden":false,"merged":[[50,1,50,9],[37,1,37,9],[40,1,40,9],[41,1,41,9],[42,1,42,9],[43,1,43,9],[44,1,44,9],[38,1,38,9],[45,1,45,9],[46,1,46,9],[47,1,47,9],[48,1,48,9],[49,1,49,9],[52,1,52,9],[53,1,53,9],[54,1,54,9],[55,1,55,9],[56,1,56,9],[69,1,69,9],[70,1,70,9],[39,1,39,9],[63,1,63,9],[64,1,64,9],[65,1,65,9],[66,1,66,9],[67,1,67,9],[68,1,68,9],[57,1,57,9],[58,1,58,9],[59,1,59,9],[60,1,60,9],[61,1,61,9],[62,1,62,9],[51,1,51,9]]}
[null,"DEFAULT VALUES FOR LCOE"]
[]
[null,"Assumption","Unit","Solar PV1,2,3","Wind4","Biomass","Bagasse cogeneration","Biomass Gasifier-based power projects","Biogas-based power projects","Small Hydro"]
[null,"Capital cost","INR/kW",38000,52500,60550,49200,59300,118600,84000]
[null,"Capital subsidy per kW","INR/kW",null,null,null,2500,15000,30000]
[null,"Plant size","kW",100,1000,1000,1000,1000,1000,1000]
[null,"Economic Life","years",25,25,25,25,25,25,40]
[null,"Capacity utilisation factor (CUF)","%",0.19,0.28999999999999998,0.8,0.53,0.85,0.9,0.3]
[null,"Auxiliary consumption","%",0,0,11,8.5,10,12,1]
[null,"Annual solar PV degradation5","%",1]
{"$rows_left_out":35}
{"sheet":"LCOS - Inputs & Results","index":5,"n_rows":75,"n_cols":12,"rows_kept":75,"cut":false,"hidden":false,"merged":[[7,2,7,4],[7,9,7,11]]}
[null,"Assumed configuration for the solar plus energy storage system: DC-coupled"]
[]
[null,null,null,"SELECT CONFIGURATION:"]
[]
[]
[]
[]
[null,null,"INPUTS",null,null,null,null,"Standalone",null,"SYSTEM SIZE & OUTPUTS"]
[null,null,"Parameter","Unit","Value",null,null,null,null,"Parameter","Unit","Value"]
[]
{"$rows_left_out":66}
{"sheet":"LCOS calc","index":6,"n_rows":113,"n_cols":29,"rows_kept":113,"cut":false,"hidden":false,"merged":[]}
["This sheet contains the LCOS calculations."]
[null,null,null,null,null,null,null,null,null,"Year ----->"]
[null,"Parameter","Unit","Cumulative",1,{"$f":"E3+1","v":2},{"$f":"F3+1","v":3},4,5,6,7,8,9,10,11,12,13,14,15,16,17,18,19,20,21,22,23,24,25]
[]
[null,"Storage cost timeline"]
[null,"Year",null,null,{"$f":"Storage_base_year","v":2020},{"$f":"E6+1","v":2021},{"$f":"F6+1","v":2022},2023,2024,2025,2026,2027,2028,2029,2030,2031,2032,2033,2034,2035,2036,2037,2038,2039,2040,2041,2042,2043,2044]
[null,"Storage operation year",null,null,{"$f":"IF(MOD(E3,Storage_life)=0, Storage_life, MOD(E3,Storage_life))","v":1},2,3,4,5,6,7,8,9,1,2,3,4,5,6,7,8,9,1,2,3,4,5,6,7]
[null,"Battery pack cost per kWh in year n","INR",null,{"$f":"IF(E7=1, (Storage_pack_capexperkWh*VLOOKUP(E6, 'Cost projections'!$C$10:$D$55, 2)/VLOOKUP(Storage_base_year, 'Cost projections'!$C$10:$D$55, 2)), 0)","v":17900},{"$f":"IF(F7=1, (Storage_pack_capexperkWh*VLOOKUP(F6, 'Cost projections'!$C$10:$D$55, 2)/VLOOKUP(Storage_base_year, 'Cost projections'!$C$10:$D$55, 2)), 0)","v":0},{"$f":"IF(G7=1, (Storage_pack_capexperkWh*VLOOKUP(G6, 'Cost projections'!$C$10:$D$55, 2)/VLOOKUP(Storage_base_year, 'Cost projections'!$C$10:$D$55, 2)), 0)","v":0},{"$f":"IF(H7=1, (Storage_pack_capexperkWh*VLOOKUP(H6, 'Cost projections'!$C$10:$D$55, 2)/VLOOKUP(Storage_base_year, 'Cost projections'!$C$10:$D$55, 2)), 0)","v":0},{"$f":"IF(I7=1, (Storage_pack_capexperkWh*VLOOKUP(I6, 'Cost projections'!$C$10:$D$55, 2)/VLOOKUP(Storage_base_year, 'Cost projections'!$C$10:$D$55, 2)), 0)","v":0},{"$f":"IF(J7=1, (Storage_pack_capexperkWh*VLOOKUP(J6, 'Cost projections'!$C$10:$D$55, 2)/VLOOKUP(Storage_base_year, 'Cost projections'!$C$10:$D$55, 2)), 0)","v":0},{"$f":"IF(K7=1, (Storage_pack_capexperkWh*VLOOKUP(K6, 'Cost projections'!$C$10:$D$55, 2)/VLOOKUP(Storage_base_year, 'Cost projections'!$C$10:$D$55, 2)), 0)","v":0},{"$f":"IF(L7=1, (Storage_pack_capexperkWh*VLOOKUP(L6, 'Cost projections'!$C$10:$D$55, 2)/VLOOKUP(Storage_base_year, 'Cost projections'!$C$10:$D$55, 2)), 0)","v":0},{"$f":"IF(M7=1, (Storage_pack_capexperkWh*VLOOKUP(M6, 'Cost projections'!$C$10:$D$55, 2)/VLOOKUP(Storage_base_year, 'Cost projections'!$C$10:$D$55, 2)), 0)","v":0},{"$f":"IF(N7=1, (Storage_pack_capexperkWh*VLOOKUP(N6, 'Cost projections'!$C$10:$D$55, 2)/VLOOKUP(Storage_base_year, 'Cost projections'!$C$10:$D$55, 2)), 0)","v":7400.3891652699303},{"$f":"IF(O7=1, (Storage_pack_capexperkWh*VLOOKUP(O6, 'Cost projections'!$C$10:$D$55, 2)/VLOOKUP(Storage_base_year, 'Cost projections'!$C$10:$D$55, 2)), 0)","v":0},{"$f":"IF(P7=1, (Storage_pack_capexperkWh*VLOOKUP(P6, 'Cost projections'!$C$10:$D$55, 2)/VLOOKUP(Storage_base_year, 'Cost projections'!$C$10:$D$55, 2)), 0)","v":0},{"$f":"IF(Q7=1, (Storage_pack_capexperkWh*VLOOKUP(Q6, 'Cost projections'!$C$10:$D$55, 2)/VLOOKUP(Storage_base_year, 'Cost projections'!$C$10:$D$55, 2)), 0)","v":0},{"$f":"IF(R7=1, (Storage_pack_capexperkWh*VLOOKUP(R6, 'Cost projections'!$C$10:$D$55, 2)/VLOOKUP(Storage_base_year, 'Cost projections'!$C$10:$D$55, 2)), 0)","v":0},{"$f":"IF(S7=1, (Storage_pack_capexperkWh*VLOOKUP(S6, 'Cost projections'!$C$10:$D$55, 2)/VLOOKUP(Storage_base_year, 'Cost projections'!$C$10:$D$55, 2)), 0)","v":0},{"$f":"IF(T7=1, (Storage_pack_capexperkWh*VLOOKUP(T6, 'Cost projections'!$C$10:$D$55, 2)/VLOOKUP(Storage_base_year, 'Cost projections'!$C$10:$D$55, 2)), 0)","v":0},{"$f":"IF(U7=1, (Storage_pack_capexperkWh*VLOOKUP(U6, 'Cost projections'!$C$10:$D$55, 2)/VLOOKUP(Storage_base_year, 'Cost projections'!$C$10:$D$55, 2)), 0)","v":0},{"$f":"IF(V7=1, (Storage_pack_capexperkWh*VLOOKUP(V6, 'Cost projections'!$C$10:$D$55, 2)/VLOOKUP(Storage_base_year, 'Cost projections'!$C$10:$D$55, 2)), 0)","v":0},{"$f":"IF(W7=1, (Storage_pack_capexperkWh*VLOOKUP(W6, 'Cost projections'!$C$10:$D$55, 2)/VLOOKUP(Storage_base_year, 'Cost projections'!$C$10:$D$55, 2)), 0)","v":5187.1699681759219},{"$f":"IF(X7=1, (Storage_pack_capexperkWh*VLOOKUP(X6, 'Cost projections'!$C$10:$D$55, 2)/VLOOKUP(Storage_base_year, 'Cost projections'!$C$10:$D$55, 2)), 0)","v":0},{"$f":"IF(Y7=1, (Storage_pack_capexperkWh*VLOOKUP(Y6, 'Cost projections'!$C$10:$D$55, 2)/VLOOKUP(Storage_base_year, 'Cost projections'!$C$10:$D$55, 2)), 0)","v":0},{"$f":"IF(Z7=1, (Storage_pack_capexperkWh*VLOOKUP(Z6, 'Cost projections'!$C$10:$D$55, 2)/VLOOKUP(Storage_base_year, 'Cost projections'!$C$10:$D$55, 2)), 0)","v":0},{"$f":"IF(AA7=1, (Storage_pack_capexperkWh*VLOOKUP(AA6, 'Cost projections'!$C$10:$D$55, 2)/VLOOKUP(Storage_base_year, 'Cost projections'!$C$10:$D$55, 2)), 0)","v":0},{"$f":"IF(AB7=1, (Storage_pack_capexperkWh*VLOOKUP(AB6, 'Cost projections'!$C$10:$D$55, 2)/VLOOKUP(Storage_base_year, 'Cost projections'!$C$10:$D$55, 2)), 0)","v":0},{"$f":"IF(AC7=1, (Storage_pack_capexperkWh*VLOOKUP(AC6, 'Cost projections'!$C$10:$D$55, 2)/VLOOKUP(Storage_base_year, 'Cost projections'!$C$10:$D$55, 2)), 0)","v":0}]
[null,"Gross capital cost","INR",null,{"$f":"IF(E7=1, (E8*Storage_capacity+Storage_enclosure_capexperkWh*Storage_capacity)*(1+Storage_system_GST)+Storage_installation_cost*(1+Storage_installation_GST), 0)","v":964968},0,0,0,0,0,0,0,0,435787.61392960447,0,0,0,0,0,0,0,0,324241.3663960665,0,0,0,0,0,0]
[null,"Net capital cost","INR",null,{"$f":"IF(E7=1, (E8*Storage_capacity+Storage_enclosure_capexperkWh*Storage_capacity)*(1-Storage_capitalsubsidy_percentage)*(1+Storage_system_GST)+Storage_installation_cost*(1+Storage_installation_GST), 0)","v":964968},0,0,0,0,0,0,0,0,435787.61392960447,0,0,0,0,0,0,0,0,324241.3663960665,0,0,0,0,0,0]
{"$rows_left_out":104}
{"sheet":"Future LCOS","index":7,"n_rows":56,"n_cols":16,"rows_kept":56,"cut":false,"hidden":false,"merged":[]}
[]
[null,"Note"]
[]
[]
[null,"Year","Solar system - Panel cost","Solar system - Inverter cost","Solar system - BoS","Solar system - Installation cost","Solar system - GST","Solar system - Capex","Solar system - O&M","Inverter cost","Inverter - O&M","Battery system - Pack cost","Battery system - BoS cost","Battery system - Installation cost","Battery system - O&M","LCOS (INR/kWh)"]
[null,{"$f":"Storage_base_year","v":2020},{"$f":"SolarPV_capex_perkW*SolarPV_capex_panelpercentage","v":0},{"$f":"SolarPV_capex_perkW*SolarPV_capex_inverterpercentage","v":0},{"$f":"SolarPV_capex_perkW*SolarPV_capex_BoSpercentage","v":0},{"$f":"SolarPV_capex_perkW*SolarPV_capex_installationpercentage","v":0},{"$f":"IF(ISNUMBER(B6),SUM(C6:F6)*SolarPV_capex_taxes/(1-SolarPV_capex_taxes),\"\")","v":0},{"$f":"IF(ISNUMBER(B6),SUM(C6:G6),\"\")","v":0},{"$f":"SolarPV_OandM_year1","v":600},{"$f":"Storage_invertercapex_perkW","v":4500},{"$f":"Storage_OandMpower_year1","v":750},{"$f":"Storage_pack_capexperkWh","v":17900},{"$f":"Storage_enclosure_capexperkWh","v":895},{"$f":"Storage_installation_cost","v":15000},{"$f":"Storage_OndMenergy_year1","v":400},28.601890113875733]
[null,{"$f":"IF(B6<2030,B6+1,\"\")","v":2021},{"$f":"IFERROR(C6+VLOOKUP(B7,Table_module_costreduction,2)*C6,\"\")","v":0},{"$f":"IFERROR(D6+VLOOKUP(B7,Table_inverter_costreduction,2)*D6,\"\")","v":0},{"$f":"IFERROR(E6+VLOOKUP(B7,Table_BoS_costreduction,2)*E6,\"\")","v":0},{"$f":"IF(ISNUMBER(B7),F6*(1+Storage_OandM_escalation),\"\")","v":0},0,{"$f":"IF(ISNUMBER(B7),SUM(C7:G7),\"\")","v":0},{"$f":"IF(ISNUMBER(B7),I6*(1+Storage_OandM_escalation),\"\")","v":623.04},{"$f":"IFERROR(J6+VLOOKUP(B7,Table_inverter_costreduction,2)*J6,\"\")","v":4005},{"$f":"IF(ISNUMBER(B7),K6*(1+Storage_OandM_escalation),\"\")","v":778.8},{"$f":"IF(Storage_battery_technology=\"Li-ion\",IFERROR(L6*VLOOKUP(B7,Table_Liionpack_costreduction,2)/VLOOKUP(B6,Table_Liionpack_costreduction,2),\"\"),IFERROR(L6*VLOOKUP(B7,Table_Pbacidpack_costreduction,2)/VLOOKUP(B6,Table_Pbacidpack_costreduction,2),\"\"))","v":16078.864672918662},{"$f":"IFERROR(M6+VLOOKUP(B7,Table_BoS_costreduction,2)*M6,\"\")","v":841.3},{"$f":"IF(ISNUMBER(B7),N6*(1+Storage_OandM_escalation),\"\")","v":15576},{"$f":"IF(ISNUMBER(B7),O6*(1+Storage_OandM_escalation),\"\")","v":415.36},27.034616102219385]
[null,{"$f":"IF(B7<2030,B7+1,\"\")","v":2022},0,0,0,0,0,0,646.9647359999999,3564.45,808.70591999999999,14424.992555432802,790.822,16174.118399999999,431.30982399999999,25.627871747097014]
[null,2023,0,0,0,0,0,0,671.80818186239992,3243.6495,839.76022732799993,12943.465939828522,751.28089999999997,16795.204546559999,447.87212124159998,24.40502747431627]
[null,2024,0,0,0,0,0,0,697.60561604591612,2951.7210450000002,872.00702005739515,11632.449132705113,713.71685500000001,17440.140401147903,465.0704106972774,23.339994121708024]
{"$rows_left_out":47}
{"sheet":"Cost projections","index":8,"n_rows":295,"n_cols":5,"rows_kept":295,"cut":false,"hidden":false,"merged":[]}
[]
[null,"Go to cost projections for:"]
[]
[]
[]
[]
[]
[null,null,"Li-ion battery pack (BtM application) cost reduction curve (central estimate from Schmidt et al. 2019)"]
[null,null,"Year","Cost (%)"]
[null,null,2015,1]
{"$rows_left_out":286}
{"sheet":"Tariff rates in TN","index":9,"n_rows":18,"n_cols":3,"rows_kept":18,"cut":false,"hidden":true,"merged":[]}
[]
[]
[null,"Tariff Category","Tariff (Rs/kWh)"]
[null,"Solar PV",0]
[null,"Domestic (1-50 kWh)",2.5]
[null,"Domestic (51-100 kWh)",2.5]
[null,"Domestic (101-250 kWh)",3]
[null,"Domestic (Above 250 kWh)",6.6]
[null,"Public Lighting",6.35]
[null,"LT Govt. Educational Institution",5.75]
{"$rows_left_out":9}
{"sheet":"Storage references","index":10,"n_rows":4,"n_cols":2,"rows_kept":4,"cut":false,"hidden":false,"merged":[[2,1,2,13],[3,1,3,13],[4,1,4,13],[5,1,5,13],[6,1,6,13],[7,1,7,13],[8,1,8,13],[9,1,9,13],[10,1,10,13],[11,1,11,13],[12,1,12,13],[13,1,13,13],[14,1,14,13],[15,1,15,13],[16,1,16,13]]}
[null,"REFERENCES"]
[]
[null,"1. The cost reduction curves for Pb acid and Li-ion have been taken from the following: \nSchmidt, O., Melchior, S., Hawkes, A., and Staffell, I. (2018). The future cost of electrical energy storage based on experience rates:dataset. Figshare Digital Repository (2018). Available at: https://doi.org/10.6084/m9.figshare"]
[null,"2. Recent price trends in panel prices, inverter cost and balance of system costs for residential, and for commercial and industrial segments were noted from, and helped in making assumptions on respective cost reductions:\nLawrence Berkeley National Lab (LBNL). (2020). Distributed Solar 2020 Data Update. Available at: https://emp.lbl.gov/tracking-the-sun/"]

{"sheet":"Results","index":11,"n_rows":18,"n_cols":11,"rows_kept":18,"cut":false,"hidden":true,"merged":[]}
[]
[]
[]
[null,null,"Parameter",null,"Unit",null,"Solar+Storage (LT Industry)",null,"Solar+Storage (LT Industry)",null,"Standalone Storage (LT Industry)"]
[null,null,"Installation year",null,null,null,2020,null,2025,null,2020]
[null,null,"Solar PV capital cost (w/o inverter)",null,"INR/kW",null,41000,null,35000,null,41000]
[null,null,"Solar PV capacity",null,"kW",null,24,null,24,null,24]
[null,null,"Inverter capital cost",null,"INR/kVA",null,20000,null,16000]
[null,null,"Inverter replacement year",null,null,null,13,null,13,null,13]
[null,null,"Inverter cost improvement in replacement year",null,null,null,0.6,null,0.7,null,0.6]
{"$rows_left_out":8}